Author: Anonymous Language: make
Description: geis build log Timestamp: 2012-12-16 09:45:48 -0500
View raw paste Reply
  1. checking for a BSD-compatible install... /usr/bin/install -c
  2. checking whether build environment is sane... yes
  3. checking for a thread-safe mkdir -p... /usr/bin/mkdir -p
  4. checking for gawk... gawk
  5. checking whether make sets $(MAKE)... yes
  6. checking whether make supports nested variables... yes
  7. checking for style of include used by make... GNU
  8. checking for gcc... gcc
  9. checking whether the C compiler works... yes
  10. checking for C compiler default output file name... a.out
  11. checking for suffix of executables...
  12. checking whether we are cross compiling... no
  13. checking for suffix of object files... o
  14. checking whether we are using the GNU C compiler... yes
  15. checking whether gcc accepts -g... yes
  16. checking for gcc option to accept ISO C89... none needed
  17. checking dependency style of gcc... gcc3
  18. checking whether gcc and cc understand -c and -o together... yes
  19. checking for g++... g++
  20. checking whether we are using the GNU C++ compiler... yes
  21. checking whether g++ accepts -g... yes
  22. checking dependency style of g++... gcc3
  23. checking whether /usr/bin/python2 version >= 2.7... yes
  24. checking for /usr/bin/python2 version... 2.7
  25. checking for /usr/bin/python2 platform... linux2
  26. checking for /usr/bin/python2 script directory... ${prefix}/lib/python2.7/site-packages
  27. checking for /usr/bin/python2 extension module directory... ${exec_prefix}/lib/python2.7/site-packages
  28. checking build system type... x86_64-unknown-linux-gnu
  29. checking host system type... x86_64-unknown-linux-gnu
  30. checking how to print strings... printf
  31. checking for a sed that does not truncate output... /bin/sed
  32. checking for grep that handles long lines and -e... /usr/bin/grep
  33. checking for egrep... /usr/bin/grep -E
  34. checking for fgrep... /usr/bin/grep -F
  35. checking for ld used by gcc... /usr/bin/ld
  36. checking if the linker (/usr/bin/ld) is GNU ld... yes
  37. checking for BSD- or MS-compatible name lister (nm)... /usr/bin/nm -B
  38. checking the name lister (/usr/bin/nm -B) interface... BSD nm
  39. checking whether ln -s works... yes
  40. checking the maximum length of command line arguments... 1572864
  41. checking whether the shell understands some XSI constructs... yes
  42. checking whether the shell understands "+="... yes
  43. checking how to convert x86_64-unknown-linux-gnu file names to x86_64-unknown-linux-gnu format... func_convert_file_noop
  44. checking how to convert x86_64-unknown-linux-gnu file names to toolchain format... func_convert_file_noop
  45. checking for /usr/bin/ld option to reload object files... -r
  46. checking for objdump... objdump
  47. checking how to recognize dependent libraries... pass_all
  48. checking for dlltool... no
  49. checking how to associate runtime and link libraries... printf %s\n
  50. checking for ar... ar
  51. checking for archiver @FILE support... @
  52. checking for strip... strip
  53. checking for ranlib... ranlib
  54. checking command to parse /usr/bin/nm -B output from gcc object... ok
  55. checking for sysroot... no
  56. checking for mt... no
  57. checking if : is a manifest tool... no
  58. checking how to run the C preprocessor... gcc -E
  59. checking for ANSI C header files... yes
  60. checking for sys/types.h... yes
  61. checking for sys/stat.h... yes
  62. checking for stdlib.h... yes
  63. checking for string.h... yes
  64. checking for memory.h... yes
  65. checking for strings.h... yes
  66. checking for inttypes.h... yes
  67. checking for stdint.h... yes
  68. checking for unistd.h... yes
  69. checking for dlfcn.h... yes
  70. checking for objdir... .libs
  71. checking if gcc supports -fno-rtti -fno-exceptions... no
  72. checking for gcc option to produce PIC... -fPIC -DPIC
  73. checking if gcc PIC flag -fPIC -DPIC works... yes
  74. checking if gcc static flag -static works... yes
  75. checking if gcc supports -c -o file.o... yes
  76. checking if gcc supports -c -o file.o... (cached) yes
  77. checking whether the gcc linker (/usr/bin/ld -m elf_x86_64) supports shared libraries... yes
  78. checking whether -lc should be explicitly linked in... no
  79. checking dynamic linker characteristics... GNU/Linux ld.so
  80. checking how to hardcode library paths into programs... immediate
  81. checking whether stripping libraries is possible... yes
  82. checking if libtool supports shared libraries... yes
  83. checking whether to build shared libraries... yes
  84. checking whether to build static libraries... no
  85. checking how to run the C++ preprocessor... g++ -E
  86. checking for ld used by g++... /usr/bin/ld -m elf_x86_64
  87. checking if the linker (/usr/bin/ld -m elf_x86_64) is GNU ld... yes
  88. checking whether the g++ linker (/usr/bin/ld -m elf_x86_64) supports shared libraries... yes
  89. checking for g++ option to produce PIC... -fPIC -DPIC
  90. checking if g++ PIC flag -fPIC -DPIC works... yes
  91. checking if g++ static flag -static works... yes
  92. checking if g++ supports -c -o file.o... yes
  93. checking if g++ supports -c -o file.o... (cached) yes
  94. checking whether the g++ linker (/usr/bin/ld -m elf_x86_64) supports shared libraries... yes
  95. checking dynamic linker characteristics... (cached) GNU/Linux ld.so
  96. checking how to hardcode library paths into programs... immediate
  97. checking for pkg-config... /usr/bin/pkg-config
  98. checking pkg-config is at least version 0.9.0... yes
  99. checking for DBUS... yes
  100. checking for GRAIL... yes
  101. checking for XCB... yes
  102. checking for XI2... yes
  103. checking for PYTHON... yes
  104. checking for XI2.1... no
  105. checking for XORG... yes
  106. checking whether hidden visibility is supported... yes
  107. checking for CHECK... no
  108. configure: WARNING: package 'check' not found: related unit testing disabled
  109. checking for /usr/src/gtest/src/gtest-all.cc... no
  110. checking for /usr/src/gtest/src/gtest_main.cc... no
  111. checking for /usr/src/gtest/src/gtest-all.cc... (cached) no
  112. checking for /usr/src/gtest/src/gtest_main.cc... (cached) no
  113. checking whether __clang__ is declared... no
  114. checking whether __INTEL_COMPILER is declared... no
  115. checking whether __SUNPRO_C is declared... no
  116. checking if g++ supports -Werror=unknown-warning-option... yes
  117. checking if g++ supports -Werror=unused-command-line-argument... yes
  118. checking if g++ supports-Wall... yes
  119. checking if g++ supports-Wpointer-arith... yes
  120. checking if g++ supports-Wmissing-declarations... yes
  121. checking if g++ supports-Wformat=2... yes
  122. checking if g++ supports-Wunused... yes
  123. checking if g++ supports-Wuninitialized... yes
  124. checking if g++ supports-Wshadow... yes
  125. checking if g++ supports-Wcast-qual... yes
  126. checking if g++ supports-Wmissing-noreturn... yes
  127. checking if g++ supports-Wmissing-format-attribute... yes
  128. checking if g++ supports-Wredundant-decls... yes
  129. checking if g++ supports-Werror=implicit... yes
  130. checking if g++ supports-Werror=nonnull... yes
  131. checking if g++ supports-Werror=init-self... yes
  132. checking if g++ supports-Werror=main... yes
  133. checking if g++ supports-Werror=missing-braces... yes
  134. checking if g++ supports-Werror=sequence-point... yes
  135. checking if g++ supports-Werror=return-type... yes
  136. checking if g++ supports-Werror=trigraphs... yes
  137. checking if g++ supports-Werror=array-bounds... yes
  138. checking if g++ supports-Werror=write-strings... yes
  139. checking if g++ supports-Werror=address... yes
  140. checking if g++ supports-Werror=int-to-pointer-cast... yes
  141. checking if g++ supports-Werror=pointer-to-int-cast... yes
  142. Package xorg-gtest was not found in the pkg-config search path.
  143. Perhaps you should add the directory containing `xorg-gtest.pc'
  144. to the PKG_CONFIG_PATH environment variable
  145. No package 'xorg-gtest' found
  146. Package xorg-gtest was not found in the pkg-config search path.
  147. Perhaps you should add the directory containing `xorg-gtest.pc'
  148. to the PKG_CONFIG_PATH environment variable
  149. No package 'xorg-gtest' found
  150. checking for X11... yes
  151. checking for EVEMU... no
  152. configure: WARNING: xorg-gtest is not available, tests will not be built
  153. configure: creating ./config.status
  154. config.status: creating Makefile
  155. config.status: creating libgeis.pc
  156. config.status: creating doc/Makefile
  157. config.status: creating include/Makefile
  158. config.status: creating libs/Makefile
  159. config.status: creating libs/geis-util/Makefile
  160. config.status: creating libs/geis-dbus/Makefile
  161. config.status: creating libgeis/Makefile
  162. config.status: creating libgeis/backend/Makefile
  163. config.status: creating libgeis/backend/test_fixture/Makefile
  164. config.status: creating libgeis/backend/dbus/Makefile
  165. config.status: creating libgeis/backend/grail/Makefile
  166. config.status: creating libgeis/server/Makefile
  167. config.status: creating testsuite/Makefile
  168. config.status: creating testsuite/gtest/Makefile
  169. config.status: creating testsuite/geis-util/Makefile
  170. config.status: creating testsuite/libgeis/Makefile
  171. config.status: creating testsuite/geis2/Makefile
  172. config.status: creating testsuite/geis1/Makefile
  173. config.status: creating testsuite/geistest/Makefile
  174. config.status: creating testsuite/x11_mocks/Makefile
  175. config.status: creating examples/Makefile
  176. config.status: creating python/Makefile
  177. config.status: creating tools/Makefile
  178. config.status: creating tools/geisview/Makefile
  179. config.status: creating tools/geis-server/Makefile
  180. config.status: creating data/Makefile
  181. config.status: creating geis_config.h
  182. config.status: geis_config.h is unchanged
  183. config.status: executing depfiles commands
  184. config.status: executing libtool commands
  185. configure:
  186. configure:  geis 2.2.14
  187. configure:  ===============================
  188. configure:
  189. configure:  prefix            : /usr
  190. configure:  integration tests : no
  191. configure:
  192. make --no-print-directory all-recursive
  193. Making all in include
  194. make[2]: Nothing to be done for `all'.
  195. Making all in libs
  196. Making all in geis-util
  197. make[3]: Nothing to be done for `all'.
  198. Making all in geis-dbus
  199. make[3]: Nothing to be done for `all'.
  200. make[3]: Nothing to be done for `all-am'.
  201. Making all in libgeis
  202. Making all in backend
  203. Making all in test_fixture
  204. make[4]: Nothing to be done for `all'.
  205. Making all in dbus
  206. make[4]: Nothing to be done for `all'.
  207. Making all in grail
  208.   CC     libgeis_grail_backend_la-geis_grail_backend.lo
  209.   CC     libgeis_grail_backend_la-geis_ugsubscription_store.lo
  210. geis_ugsubscription_store.c:25:27: fatal error: oif/frame_x11.h: No such file or directory
  211. compilation terminated.
  212. make[4]: *** [libgeis_grail_backend_la-geis_ugsubscription_store.lo] Error 1
  213. make[4]: *** Waiting for unfinished jobs....
  214. geis_grail_backend.c:42:27: fatal error: oif/frame_x11.h: No such file or directory
  215. compilation terminated.
  216. make[4]: *** [libgeis_grail_backend_la-geis_grail_backend.lo] Error 1
  217. make[3]: *** [all-recursive] Error 1
  218. make[2]: *** [all-recursive] Error 1
  219. make[1]: *** [all-recursive] Error 1
  220. make: *** [all] Error 2
  221. ==> ERROR: A failure occurred in build().
  222.     Aborting...
  223. The build failed.
View raw paste Reply